Aller au contenu
ElementaryOS France

Watson

Membres
  • Compteur de contenus

    27
  • Inscription

  • Dernière visite

  1. Avec plaisir ! L'info, c'est comme le sang, faut que ça circule.
  2. Installation sur Samsung Nc20

    Bonjour, A l'attention des administrateurs : comme je ne pouvais plus utiliser mon ordi à cause de ce problème de drivers mal gérés par le Samsung NC 20 et sa carte graphique daubesque, et que je n'ai jamais trouvé de solutions... j'ai dû désinstaller ce très bel Elementary OS. Dommage, il me plaisait bien, mais c'était impossible de travailler avec mon netbook. :| Du coup, pour ceux que ça intéresse, j'ai installé Crunchbang Waldorf. C'est un peu plus fluide. En bref, je peux bosser, malgré quelques lenteurs. Longue vie à Elementary OS ! ps : vous pouvez aussi fermer le post concernant la mise à jour du Kernel ! A bientôt pour de nouvelles aventures avec Elementary ! W.
  3. Salut, Pour info : une double page dans le numéro de décembre 2013. Bonne journée ! W.
  4. Installation du kernel 3.11.2

    Bonjour SchyzO, Euh, la commande ne renvoit rien... Le prompt se remet à clignoter (comme quand on ouvre le Terminal). W.
  5. Installation sur Samsung Nc20

    Bonjour, J'ai téléchargé le kernel 3.11.2, relancé l'installation des drivers. Le terminal me retourne : Build VIA_Chrome9 DRM driver Error! please check make.log file. Make.log : make -C /lib/modules/3.11.2-031102-generic/build M=/home/greg/Téléchargements/TTM/3.4.0-3.6.0/via_chrome9_ttm DRV_PATH=`pwd` modules make[1]: entrant dans le répertoire « /usr/src/linux-headers-3.11.2-031102-generic » CC [M] /home/greg/Téléchargements/TTM/3.4.0-3.6.0/via_chrome9_ttm/via_chrome9_cbios.o make[1]: quittant le répertoire « /usr/src/linux-headers-3.11.2-031102-generic » ia_chrome9_drv.h:40:0, from /home/greg/Téléchargements/TTM/3.4.0-3.6.0/via_chrome9_ttm/via_chrome9_cbios.c:26: /home/greg/Téléchargements/TTM/3.4.0-3.6.0/via_chrome9_ttm/via_chrome9_mode.h:29:22: erreur fatale: drm_mode.h : Aucun fichier ou dossier de ce type compilation terminée. make[2]: *** [/home/greg/Téléchargements/TTM/3.4.0-3.6.0/via_chrome9_ttm/via_chrome9_cbios.o] Erreur 1 make[1]: *** [_module_/home/greg/Téléchargements/TTM/3.4.0-3.6.0/via_chrome9_ttm] Erreur 2 make: *** [default] Erreur 2 Si quelqu'un a une solution... J'ai l'impression d'être dans une impasse. W.
  6. Installation du kernel 3.11.2

    Bonjour Nyrhu, Merci pour ta réponse rapide. Comme je suis débutant, j'apprends toujours quelque chose avec toutes ces manips. Pour l'instant la mise à jour n'a pas résolu mon problème (toujours aussi lent), mais elle permettra peut-être (je l'espère) aux drivers de s'installer correctement. La commande retourne : ii linux-headers-3.11.2-031102 3.11.2-031102.201309262136 Header files related to Linux kernel version 3.11.2 ii linux-headers-3.11.2-031102-generic 3.11.2-031102.201309262136 Linux kernel headers for version 3.11.2 on 32 bit x86 SMP ii linux-headers-3.2.0-51 3.2.0-51.77 Header files related to Linux kernel version 3.2.0 ii linux-headers-3.2.0-51-generic-pae 3.2.0-51.77 Linux kernel headers for version 3.2.0 on 32 bit x86 SMP ii linux-headers-3.2.0-54 3.2.0-54.82 Header files related to Linux kernel version 3.2.0 ii linux-headers-3.2.0-54-generic 3.2.0-54.82 Linux kernel headers for version 3.2.0 on 32 bit x86 SMP ii linux-headers-generic 3.2.0.54.64 Generic Linux kernel headers ii linux-headers-generic-pae 3.2.0.51.61 Generic Linux kernel headers ii linux-image-3.11.2-031102-generic 3.11.2-031102.201309262136 Linux kernel image for version 3.11.2 on 32 bit x86 SMP ii linux-image-3.2.0-51-generic-pae 3.2.0-51.77 Linux kernel image for version 3.2.0 on 32 bit x86 SMP ii linux-image-generic-pae 3.2.0.51.61 Generic Linux kernel image Hum, je vois bien la 3.11.2 que je viens d'installer..., mais quelle est la version à purger ? Merci. W.
  7. Installation du kernel 3.11.2

    Bonjour, J'ai installé le nouveau Kernel (3.11.2) pour palier à mon problème de carte graphique Via (voir post sur le Samsung nc 20)... Daniel c corrige la manip de Thomas en sudo apt-get purge linux-image-3.10.9*.... Mais ce n'est pas la version que j'avais... Comment connaître la bonne version à purger ? C'est la 3.11.1 ? J'ai installé Elementary la semaine dernière. Je préfère poser la question avant de faire une connerie. Bonne journée ! W.
  8. Installation sur Samsung Nc20

    Bonjour, Je réponds à une partie de mon message. J'ai trouvé la manière de changer le papier peint. J'ai cherché quelque chose de compliqué, alors que c'était fort simple. Elémentaire. Merci Kido pour ton lien sur le tuto utilisation du Terminal. Je me penche sur le sujet. W.
  9. Installation sur Samsung Nc20

    Bonjour Kido, La procédure de Thomas semble simple. C'est un bon point pour un novice comme moi. Ma connexion Internet est assez capricieuse en ce moment, vaut peut-être mieux que je retarde la manip... Je voudrais éviter que ça plante au milieu. :/ J'ai trouvé des tutoriaux à droite et à gauche, mais paradoxalement aucun qui explique comment ajouter des fonds d'écran dans le dossier. Quand j'essaye de copier les images dans usr/share/background, cela ne fonctionne pas. J'ai encore mes réflexes de Windows, peut-être... Pourrais-tu me donner l'astuce pour ajouter des images. Merci ! Je vous tiens au courant. W.
  10. Installation sur Samsung Nc20

    Salut, Je tenterai par acquis de conscience, comme tu dis, avec mesa 7.11. C'est vrai que cet ordi n'a jamais été un foudre de guerre. Je vais continuer à chercher. Une bonne manière d'apprendre des trucs utiles. Eos vaut la peine qu'on se décarcasse un peu. Merci encore pour votre aide W.
  11. Installation sur Samsung Nc20

    Salut Kido, Merci pour la manip ! Ces icones sont vraiment top. Concernant mes drivers Via : j'ai tenté d'installer le contenu du dossier mesa 8.1 Je peux peut-être essayer avec mesa 7.11... Dans le readme : So if customers are sure the AP or games not including GLSL OP, you can using mesa8.1. but if not sure or sure including GLSL OP, using as mesa 7.11 would be better than mesa 8.1 from SW supported view, or it may cause segmentfault in G3D driver. Je ne voudrais pas faire une connerie. Tu penses que ça pourrait changer quelque chose ? W.
  12. Installation sur Samsung Nc20

    Hello Devil505, Merci en tout cas pour ton aide. Merci aussi à Kido . Je vais continuer à chercher. A force d'installer des trucs, le % de cpu utilisé avec gala fait un chouia le yoyo. Du coup, c'est un peu moins pire en terme de lenteur. J'en profite pour te poser une autre question : j'ai installé via le terminal le très joli pacifica-icon-theme, mais Je ne sais pas comment l'activer à partir de usr/share/icons ? C'est en forgeant qu'on devient forgeron W.
  13. Installation sur Samsung Nc20

    J'ai copié les fichiers dans le dossier téléchargement. Du coup je lance la commande comme ça : [email protected]:~/Téléchargements$ sudo sh vinstall Laquelle retourne : [sudo] password for greg: install the via driver! .........-e Build VIA_Chrome9 DRM driver Error! please check make.log file Hum, je ne sais pas trop quoi en penser Il y a une manip à faire dans ce lien :[url= http://www.viaarena.com/forums/archive/index.php?t-44616.html] http://www.viaarena.com/forums/archive/index.php?t-44616.html[/url] C'est malheureusement en dehors de mes compétences. Cela ne smble pas trop bien marché non plus. ////////////////////////////////////////// le contenu de make.log /////////// make -C /lib/modules/3.2.0-51-generic-pae/build M=/home/greg/Téléchargements/TTM/3.4.0-3.6.0/via_chrome9_ttm DRV_PATH=`pwd` modules make[1]: entrant dans le répertoire « /usr/src/linux-headers-3.2.0-51-generic-pae » CC [M] /home/greg/Téléchargements/TTM/3.4.0-3.6.0/via_chrome9_ttm/via_chrome9_cbios.o CC [M] /home/greg/Téléchargements/TTM/3.4.0-3.6.0/via_chrome9_ttm/via_chrome9_drv.o CC [M] /home/greg/Téléchargements/TTM/3.4.0-3.6.0/via_chrome9_ttm/via_chrome9_drm.o CC [M] /home/greg/Téléchargements/TTM/3.4.0-3.6.0/via_chrome9_ttm/via_chrome9_mm.o CC [M] /home/greg/Téléchargements/TTM/3.4.0-3.6.0/via_chrome9_ttm/via_chrome9_dma.o CC [M] /home/greg/Téléchargements/TTM/3.4.0-3.6.0/via_chrome9_ttm/via_chrome9_verifier.o CC [M] /home/greg/Téléchargements/TTM/3.4.0-3.6.0/via_chrome9_ttm/via_chrome9_init.o CC [M] /home/greg/Téléchargements/TTM/3.4.0-3.6.0/via_chrome9_ttm/via_chrome9_ttm.o make[1]: quittant le répertoire « /usr/src/linux-headers-3.2.0-51-generic-pae » abled by default] In file included from /home/greg/Téléchargements/TTM/3.4.0-3.6.0/via_chrome9_ttm/via_chrome9_mode.h:32:0, from /home/greg/Téléchargements/TTM/3.4.0-3.6.0/via_chrome9_ttm/via_chrome9_drv.h:40, from /home/greg/Téléchargements/TTM/3.4.0-3.6.0/via_chrome9_ttm/via_chrome9_drm.h:28, from /home/greg/Téléchargements/TTM/3.4.0-3.6.0/via_chrome9_ttm/via_chrome9_drv.c:26: /home/greg/Téléchargements/TTM/3.4.0-3.6.0/via_chrome9_ttm/via_chrome9_fb.h:37:10: attention : ‘struct drm_mode_fb_cmd2’ declared inside parameter list [enabled by default] /home/greg/Téléchargements/TTM/3.4.0-3.6.0/via_chrome9_ttm/via_chrome9_fb.h:37:10: attention : visible uniquement depuis cette définition ou déclaration, ce qui n'est probablement pas ce que vous désirez [enabled by default] /home/greg/Téléchargements/TTM/3.4.0-3.6.0/via_chrome9_ttm/via_chrome9_drv.c:302:2: attention : accolades manquantes autour de l'initialisation [-Wmissing-braces] /home/greg/Téléchargements/TTM/3.4.0-3.6.0/via_chrome9_ttm/via_chrome9_drv.c:302:2: attention : (near initialization for ‘driver.fops’) [-Wmissing-braces] /home/greg/Téléchargements/TTM/3.4.0-3.6.0/via_chrome9_ttm/via_chrome9_drv.c:302:2: attention : initialization from incompatible pointer type [enabled by default] /home/greg/Téléchargements/TTM/3.4.0-3.6.0/via_chrome9_ttm/via_chrome9_drv.c:302:2: attention : (near initialization for ‘driver.fops.owner’) [enabled by default] In file included from /home/greg/Téléchargements/TTM/3.4.0-3.6.0/via_chrome9_ttm/via_chrome9_mode.h:32:0, from /home/greg/Téléchargements/TTM/3.4.0-3.6.0/via_chrome9_ttm/via_chrome9_drv.h:40, from /home/greg/Téléchargements/TTM/3.4.0-3.6.0/via_chrome9_ttm/via_chrome9_drm.h:28, from /home/greg/Téléchargements/TTM/3.4.0-3.6.0/via_chrome9_ttm/via_chrome9_drm.c:27: /home/greg/Téléchargements/TTM/3.4.0-3.6.0/via_chrome9_ttm/via_chrome9_fb.h:37:10: attention : ‘struct drm_mode_fb_cmd2’ declared inside parameter list [enabled by default] /home/greg/Téléchargements/TTM/3.4.0-3.6.0/via_chrome9_ttm/via_chrome9_fb.h:37:10: attention : visible uniquement depuis cette définition ou déclaration, ce qui n'est probablement pas ce que vous désirez [enabled by default] In file included from /home/greg/Téléchargements/TTM/3.4.0-3.6.0/via_chrome9_ttm/via_chrome9_mode.h:32:0, from /home/greg/Téléchargements/TTM/3.4.0-3.6.0/via_chrome9_ttm/via_chrome9_drv.h:40, from /home/greg/Téléchargements/TTM/3.4.0-3.6.0/via_chrome9_ttm/via_chrome9_drm.h:28, from /home/greg/Téléchargements/TTM/3.4.0-3.6.0/via_chrome9_ttm/via_chrome9_mm.c:26: /home/greg/Téléchargements/TTM/3.4.0-3.6.0/via_chrome9_ttm/via_chrome9_fb.h:37:10: attention : ‘struct drm_mode_fb_cmd2’ declared inside parameter list [enabled by default] /home/greg/Téléchargements/TTM/3.4.0-3.6.0/via_chrome9_ttm/via_chrome9_fb.h:37:10: attention : visible uniquement depuis cette définition ou déclaration, ce qui n'est probablement pas ce que vous désirez [enabled by default] In file included from /home/greg/Téléchargements/TTM/3.4.0-3.6.0/via_chrome9_ttm/via_chrome9_mode.h:32:0, from /home/greg/Téléchargements/TTM/3.4.0-3.6.0/via_chrome9_ttm/via_chrome9_drv.h:40, from /home/greg/Téléchargements/TTM/3.4.0-3.6.0/via_chrome9_ttm/via_chrome9_drm.h:28, from /home/greg/Téléchargements/TTM/3.4.0-3.6.0/via_chrome9_ttm/via_chrome9_dma.c:27: /home/greg/Téléchargements/TTM/3.4.0-3.6.0/via_chrome9_ttm/via_chrome9_fb.h:37:10: attention : ‘struct drm_mode_fb_cmd2’ declared inside parameter list [enabled by default] /home/greg/Téléchargements/TTM/3.4.0-3.6.0/via_chrome9_ttm/via_chrome9_fb.h:37:10: attention : visible uniquement depuis cette définition ou déclaration, ce qui n'est probablement pas ce que vous désirez [enabled by default] In file included from /home/greg/Téléchargements/TTM/3.4.0-3.6.0/via_chrome9_ttm/via_chrome9_mode.h:32:0, from /home/greg/Téléchargements/TTM/3.4.0-3.6.0/via_chrome9_ttm/via_chrome9_drv.h:40, from /home/greg/Téléchargements/TTM/3.4.0-3.6.0/via_chrome9_ttm/via_chrome9_drm.h:28, from /home/greg/Téléchargements/TTM/3.4.0-3.6.0/via_chrome9_ttm/via_chrome9_verifier.c:37: /home/greg/Téléchargements/TTM/3.4.0-3.6.0/via_chrome9_ttm/via_chrome9_fb.h:37:10: attention : ‘struct drm_mode_fb_cmd2’ declared inside parameter list [enabled by default] /home/greg/Téléchargements/TTM/3.4.0-3.6.0/via_chrome9_ttm/via_chrome9_fb.h:37:10: attention : visible uniquement depuis cette définition ou déclaration, ce qui n'est probablement pas ce que vous désirez [enabled by default] In file included from /home/greg/Téléchargements/TTM/3.4.0-3.6.0/via_chrome9_ttm/via_chrome9_mode.h:32:0, from /home/greg/Téléchargements/TTM/3.4.0-3.6.0/via_chrome9_ttm/via_chrome9_drv.h:40, from /home/greg/Téléchargements/TTM/3.4.0-3.6.0/via_chrome9_ttm/via_chrome9_drm.h:28, from /home/greg/Téléchargements/TTM/3.4.0-3.6.0/via_chrome9_ttm/via_chrome9_init.c:26: /home/greg/Téléchargements/TTM/3.4.0-3.6.0/via_chrome9_ttm/via_chrome9_fb.h:37:10: attention : ‘struct drm_mode_fb_cmd2’ declared inside parameter list [enabled by default] /home/greg/Téléchargements/TTM/3.4.0-3.6.0/via_chrome9_ttm/via_chrome9_fb.h:37:10: attention : visible uniquement depuis cette définition ou déclaration, ce qui n'est probablement pas ce que vous désirez [enabled by default] In file included from /home/greg/Téléchargements/TTM/3.4.0-3.6.0/via_chrome9_ttm/via_chrome9_mode.h:32:0, from /home/greg/Téléchargements/TTM/3.4.0-3.6.0/via_chrome9_ttm/via_chrome9_drv.h:40, from /home/greg/Téléchargements/TTM/3.4.0-3.6.0/via_chrome9_ttm/via_chrome9_drm.h:28, from /home/greg/Téléchargements/TTM/3.4.0-3.6.0/via_chrome9_ttm/via_chrome9_ttm.c:26: /home/greg/Téléchargements/TTM/3.4.0-3.6.0/via_chrome9_ttm/via_chrome9_fb.h:37:10: attention : ‘struct drm_mode_fb_cmd2’ declared inside parameter list [enabled by default] /home/greg/Téléchargements/TTM/3.4.0-3.6.0/via_chrome9_ttm/via_chrome9_fb.h:37:10: attention : visible uniquement depuis cette définition ou déclaration, ce qui n'est probablement pas ce que vous désirez [enabled by default] /home/greg/Téléchargements/TTM/3.4.0-3.6.0/via_chrome9_ttm/via_chrome9_ttm.c: In function ‘via_chrome9_pcie_bind’: /home/greg/Téléchargements/TTM/3.4.0-3.6.0/via_chrome9_ttm/via_chrome9_ttm.c:57:12: erreur: ‘struct ttm_tt’ has no member named ‘bdev’ /home/greg/Téléchargements/TTM/3.4.0-3.6.0/via_chrome9_ttm/via_chrome9_ttm.c: In function ‘via_chrome9_pcie_unbind’: /home/greg/Téléchargements/TTM/3.4.0-3.6.0/via_chrome9_ttm/via_chrome9_ttm.c:122:12: erreur: ‘struct ttm_tt’ has no member named ‘bdev’ /home/greg/Téléchargements/TTM/3.4.0-3.6.0/via_chrome9_ttm/via_chrome9_ttm.c: In function ‘via_chrome9_pcie_destroy’: /home/greg/Téléchargements/TTM/3.4.0-3.6.0/via_chrome9_ttm/via_chrome9_ttm.c:169:2: erreur: implicit declaration of function ‘ttm_tt_fini’ [-Werror=implicit-function-declaration] /home/greg/Téléchargements/TTM/3.4.0-3.6.0/via_chrome9_ttm/via_chrome9_ttm.c: Hors de toute fonction : /home/greg/Téléchargements/TTM/3.4.0-3.6.0/via_chrome9_ttm/via_chrome9_ttm.c:173:2: attention : initialization from incompatible pointer type [enabled by default] /home/greg/Téléchargements/TTM/3.4.0-3.6.0/via_chrome9_ttm/via_chrome9_ttm.c:173:2: attention : (near initialization for ‘via_chrome9_be_func.bind’) [enabled by default] /home/greg/Téléchargements/TTM/3.4.0-3.6.0/via_chrome9_ttm/via_chrome9_ttm.c:174:2: attention : initialization from incompatible pointer type [enabled by default] /home/greg/Téléchargements/TTM/3.4.0-3.6.0/via_chrome9_ttm/via_chrome9_ttm.c:174:2: attention : (near initialization for ‘via_chrome9_be_func.unbind’) [enabled by default] /home/greg/Téléchargements/TTM/3.4.0-3.6.0/via_chrome9_ttm/via_chrome9_ttm.c:175:2: attention : initialization from incompatible pointer type [enabled by default] /home/greg/Téléchargements/TTM/3.4.0-3.6.0/via_chrome9_ttm/via_chrome9_ttm.c:175:2: attention : (near initialization for ‘via_chrome9_be_func.destroy’) [enabled by default] /home/greg/Téléchargements/TTM/3.4.0-3.6.0/via_chrome9_ttm/via_chrome9_ttm.c: In function ‘via_chrome9_ttm_tt_create’: /home/greg/Téléchargements/TTM/3.4.0-3.6.0/via_chrome9_ttm/via_chrome9_ttm.c:194:5: erreur: ‘struct ttm_tt’ has no member named ‘func’ /home/greg/Téléchargements/TTM/3.4.0-3.6.0/via_chrome9_ttm/via_chrome9_ttm.c:199:2: erreur: implicit declaration of function ‘ttm_tt_init’ [-Werror=implicit-function-declaration] /home/greg/Téléchargements/TTM/3.4.0-3.6.0/via_chrome9_ttm/via_chrome9_ttm.c: In function ‘via_chrome9_ttm_tt_populate’: /home/greg/Téléchargements/TTM/3.4.0-3.6.0/via_chrome9_ttm/via_chrome9_ttm.c:211:2: erreur: implicit declaration of function ‘ttm_pool_populate’ [-Werror=implicit-function-declaration] /home/greg/Téléchargements/TTM/3.4.0-3.6.0/via_chrome9_ttm/via_chrome9_ttm.c: In function ‘via_chrome9_ttm_tt_unpopulate’: /home/greg/Téléchargements/TTM/3.4.0-3.6.0/via_chrome9_ttm/via_chrome9_ttm.c:216:2: erreur: implicit declaration of function ‘ttm_pool_unpopulate’ [-Werror=implicit-function-declaration] /home/greg/Téléchargements/TTM/3.4.0-3.6.0/via_chrome9_ttm/via_chrome9_ttm.c: Hors de toute fonction : /home/greg/Téléchargements/TTM/3.4.0-3.6.0/via_chrome9_ttm/via_chrome9_ttm.c:575:2: erreur: unknown field ‘ttm_tt_create’ specified in initializer /home/greg/Téléchargements/TTM/3.4.0-3.6.0/via_chrome9_ttm/via_chrome9_ttm.c:575:2: attention : initialization from incompatible pointer type [enabled by default] /home/greg/Téléchargements/TTM/3.4.0-3.6.0/via_chrome9_ttm/via_chrome9_ttm.c:575:2: attention : (near initialization for ‘via_chrome9_bo_driver.create_ttm_backend_entry’) [enabled by default] /home/greg/Téléchargements/TTM/3.4.0-3.6.0/via_chrome9_ttm/via_chrome9_ttm.c:576:2: erreur: unknown field ‘ttm_tt_populate’ specified in initializer /home/greg/Téléchargements/TTM/3.4.0-3.6.0/via_chrome9_ttm/via_chrome9_ttm.c:576:2: attention : initialization from incompatible pointer type [enabled by default] /home/greg/Téléchargements/TTM/3.4.0-3.6.0/via_chrome9_ttm/via_chrome9_ttm.c:576:2: attention : (near initialization for ‘via_chrome9_bo_driver.invalidate_caches’) [enabled by default] /home/greg/Téléchargements/TTM/3.4.0-3.6.0/via_chrome9_ttm/via_chrome9_ttm.c:577:2: erreur: unknown field ‘ttm_tt_unpopulate’ specified in initializer /home/greg/Téléchargements/TTM/3.4.0-3.6.0/via_chrome9_ttm/via_chrome9_ttm.c:577:2: attention : initialization from incompatible pointer type [enabled by default] /home/greg/Téléchargements/TTM/3.4.0-3.6.0/via_chrome9_ttm/via_chrome9_ttm.c:577:2: attention : (near initialization for ‘via_chrome9_bo_driver.init_mem_type’) [enabled by default] cc1: some warnings being treated as errors make[2]: *** [/home/greg/Téléchargements/TTM/3.4.0-3.6.0/via_chrome9_ttm/via_chrome9_ttm.o] Erreur 1 make[1]: *** [_module_/home/greg/Téléchargements/TTM/3.4.0-3.6.0/via_chrome9_ttm] Erreur 2 make: *** [default] Erreur 2 ////////////////////////////// fin fichier ///////////////
  14. Installation sur Samsung Nc20

    Bonjour Devil505, . Ce problème représente un bon baptème du feu pour mon entrée dans le monde Linux. J'ai suivi tes instructions. Après l'installation de build-essential... la commande : sudo sh vinstall me renvoit : sh: 0: Can't open vinstall W.
  15. Installation sur Samsung Nc20

    Bonjour Kido, La commande retourne : i386 W.
×